Target
Muscarinic acetylcholine receptor M3
Ligand
BDBM50296345
Substrate
Meas. Tech.
ChEMBL_687865 (CHEMBL1291429)
IC50
0.0501±n/a nM
Citation
 Stocks, MJAlcaraz, LBailey, ABowers, KDonald, DEdwards, HHunt, FKindon, NPairaudeau, GTheaker, JWarner, DJ The discovery of new spirocyclic muscarinic M3 antagonists. Bioorg Med Chem Lett 20:7458-61 (2010)  
Target
Name:
Muscarinic acetylcholine receptor M3
Synonyms:
ACM3_HUMAN Cholinergic, muscarinic M3 Muscarinic receptor M3 | RecName: Full=Muscarinic acetylcholine receptor M3
Type:
Enzyme
Mol. Mass.:
66151.03
Organism:
Homo sapiens (Human)
Description:
P20309
Residue:
590
  
Inhibitor
Name:
BDBM50296345
Synonyms:
(1R,2R,4S,5R,7S)-7-(2-hydroxy-2,2-di-thiophen-2-yl-acetoxy)-9,9-dimethyl-3-oxa-9-azonia-tricyclo[3.3.1.0*2,4*]nonane bromide Tiotropium Bromide
Type:
Small organic molecule
Emp. Form.:
C19H22NO4S2
Mol. Mass.:
392.512
SMILES:
C[N+]1(C)[C@@H]2C[C@H](C[C@@H]1[C@@H]1O[C@H]21)OC(=O)C(O)(c1cccs1)c1cccs1
: