Target
Muscarinic acetylcholine receptor M1
Ligand
BDBM50417445
Substrate
Meas. Tech.
ChEMBL_687866 (CHEMBL1291430)
IC50
0.126±n/a nM
Citation
 Stocks, MJAlcaraz, LBailey, ABowers, KDonald, DEdwards, HHunt, FKindon, NPairaudeau, GTheaker, JWarner, DJ The discovery of new spirocyclic muscarinic M3 antagonists. Bioorg Med Chem Lett 20:7458-61 (2010)  
Target
Name:
Muscarinic acetylcholine receptor M1
Synonyms:
ACM1_HUMAN Cholinergic receptor, muscarinic 1 | Cholinergic, muscarinic M1
Type:
Protein
Mol. Mass.:
51442.54
Organism:
Homo sapiens (Human)
Description:
P11229
Residue:
460
  
Inhibitor
Name:
BDBM50417445
Synonyms:
AHR-504 GLYCOPYRROLATE
Type:
Small organic molecule
Emp. Form.:
C19H28NO3
Mol. Mass.:
318.43
SMILES:
C[N+]1(C)CCC(C1)OC(=O)C(O)(C1CCCC1)c1ccccc1
: