Target
Acetylcholinesterase
Ligand
BDBM50039733
Substrate
Meas. Tech.
ChEMBL_715113 (CHEMBL1664219)
IC50
218.78±n/a nM
Citation
 Araújo, JQde Brito, MAHoelz, LVde Alencastro, RBCastro, HCRodrigues, CRAlbuquerque, MG Receptor-dependent (RD) 3D-QSAR approach of a series of benzylpiperidine inhibitors of human acetylcholinesterase (HuAChE). Eur J Med Chem 46:39-51 (2010)  
Target
Name:
Acetylcholinesterase
Synonyms:
ACES_HUMAN Acetylcholinesterase (AChE) | Acetylcholinesterase (human AChE)
Type:
Enzyme
Mol. Mass.:
67792.70
Organism:
Homo sapiens (Human)
Description:
P22303
Residue:
614
  
Inhibitor
Name:
BDBM50039733
Synonyms:
1-(2-(1-benzylpiperidin-4-yl)ethyl)isoquinoline CHEMBL92142
Type:
Small organic molecule
Emp. Form.:
C23H26N2
Mol. Mass.:
330.4659
SMILES:
C(Cc1nccc2ccccc12)C1CCN(Cc2ccccc2)CC1
: