Target
Acetylcholinesterase
Ligand
BDBM50318740
Substrate
Meas. Tech.
ChEMBL_715113 (CHEMBL1664219)
IC50
208.93±n/a nM
Citation
 Araújo, JQde Brito, MAHoelz, LVde Alencastro, RBCastro, HCRodrigues, CRAlbuquerque, MG Receptor-dependent (RD) 3D-QSAR approach of a series of benzylpiperidine inhibitors of human acetylcholinesterase (HuAChE). Eur J Med Chem 46:39-51 (2010)  
Target
Name:
Acetylcholinesterase
Synonyms:
ACES_HUMAN Acetylcholinesterase (AChE) | Acetylcholinesterase (human AChE)
Type:
Enzyme
Mol. Mass.:
67792.70
Organism:
Homo sapiens (Human)
Description:
P22303
Residue:
614
  
Inhibitor
Name:
BDBM50318740
Synonyms:
(E)-3-(2-(1-benzylpiperidin-4-yl)vinyl)benzo[d]isoxazole CHEMBL126939
Type:
Small organic molecule
Emp. Form.:
C21H22N2O
Mol. Mass.:
318.4122
SMILES:
C(N1CCC(CC1)\C=C\c1noc2ccccc12)c1ccccc1
: