Target
Histamine H4 receptor
Ligand
BDBM50418058
Substrate
Meas. Tech.
ChEMBL_735236 (CHEMBL1694498)
EC50
1±n/a nM
Citation
 Wijtmans, Mde Graaf, Cde Kloe, GIstyastono, EPSmit, JLim, HBoonnak, RNijmeijer, SSmits, RAJongejan, AZuiderveld, Ode Esch, IJLeurs, R Triazole ligands reveal distinct molecular features that induce histamine H4 receptor affinity and subtly govern H4/H3 subtype selectivity. J Med Chem 54:1693-703 (2011)  
Target
Name:
Histamine H4 receptor
Synonyms:
AXOR35 GPCR105 HH4R HRH4 Histamine H4 receptor Histamine receptor (H3 and H4) SP9144
Type:
G Protein-Coupled Receptor (GPCR)
Mol. Mass.:
44517.02
Organism:
Homo sapiens (Human)
Description:
Binding assays were using CHO cells stably expressing hH4R receptors.
Residue:
390
  
Inhibitor
Name:
BDBM50418058
Synonyms:
CHEMBL1688946
Type:
Small organic molecule
Emp. Form.:
C15H23N5
Mol. Mass.:
273.3766
SMILES:
C(Cc1cnc[nH]1)Cn1cc(CC2CCCCC2)nn1
: