Target
Amine oxidase [flavin-containing] A
Ligand
BDBM50273529
Substrate
Meas. Tech.
ChEMBL_739780 (CHEMBL1763606)
Ki
6501296.9±n/a nM
Citation
 Shelke, SMBhosale, SHDash, RCSuryawanshi, MRMahadik, KR Exploration of new scaffolds as potential MAO-A inhibitors using pharmacophore and 3D-QSAR based in silico screening. Bioorg Med Chem Lett 21:2419-24 (2011)  
Target
Name:
Amine oxidase [flavin-containing] A
Synonyms:
AOFA_HUMAN MAO-A Monoamine oxidase Monoamine oxidase type A (MAO A) Monoamine oxidase type A (MAOA)
Type:
Protein
Mol. Mass.:
59689.53
Organism:
Homo sapiens (Human)
Description:
P21397
Residue:
527
  
Inhibitor
Name:
BDBM50273529
Synonyms:
CHEMBL503807 | N-Methyl,N-(2-phenylethyl)-1-methyl-1H-indole-2-carboxamide
Type:
Small organic molecule
Emp. Form.:
C19H20N2O
Mol. Mass.:
292.3749
SMILES:
CN(CCc1ccccc1)C(=O)c1cc2ccccc2n1C
: