Target
Amine oxidase [flavin-containing] A
Ligand
BDBM50273565
Substrate
Meas. Tech.
ChEMBL_739780 (CHEMBL1763606)
Ki
99900000±n/a nM
Citation
 Shelke, SMBhosale, SHDash, RCSuryawanshi, MRMahadik, KR Exploration of new scaffolds as potential MAO-A inhibitors using pharmacophore and 3D-QSAR based in silico screening. Bioorg Med Chem Lett 21:2419-24 (2011)  
Target
Name:
Amine oxidase [flavin-containing] A
Synonyms:
AOFA_HUMAN MAO-A Monoamine oxidase Monoamine oxidase type A (MAO A) Monoamine oxidase type A (MAOA)
Type:
Protein
Mol. Mass.:
59689.53
Organism:
Homo sapiens (Human)
Description:
P21397
Residue:
527
  
Inhibitor
Name:
BDBM50273565
Synonyms:
CHEMBL447043 | N-(1H-Indol-2-ylmethyl)-N-phenylamine
Type:
Small organic molecule
Emp. Form.:
C15H14N2
Mol. Mass.:
222.2851
SMILES:
C(Nc1ccccc1)c1cc2ccccc2[nH]1
: