Target
Amine oxidase [flavin-containing] A
Ligand
BDBM50273590
Substrate
Meas. Tech.
ChEMBL_739780 (CHEMBL1763606)
Ki
10000000±n/a nM
Citation
 Shelke, SMBhosale, SHDash, RCSuryawanshi, MRMahadik, KR Exploration of new scaffolds as potential MAO-A inhibitors using pharmacophore and 3D-QSAR based in silico screening. Bioorg Med Chem Lett 21:2419-24 (2011)  
Target
Name:
Amine oxidase [flavin-containing] A
Synonyms:
AOFA_HUMAN MAO-A Monoamine oxidase Monoamine oxidase type A (MAO A) Monoamine oxidase type A (MAOA)
Type:
Protein
Mol. Mass.:
59689.53
Organism:
Homo sapiens (Human)
Description:
P21397
Residue:
527
  
Inhibitor
Name:
BDBM50273590
Synonyms:
CHEMBL449889 | N-(1-Methyl-1H-indol-2-ylmethyl)-N-phenylamine
Type:
Small organic molecule
Emp. Form.:
C16H16N2
Mol. Mass.:
236.3116
SMILES:
Cn1c(CNc2ccccc2)cc2ccccc12
: