Target
Amine oxidase [flavin-containing] A
Ligand
BDBM15586
Substrate
Meas. Tech.
ChEMBL_739780 (CHEMBL1763606)
Ki
6998419.96±n/a nM
Citation
 Shelke, SMBhosale, SHDash, RCSuryawanshi, MRMahadik, KR Exploration of new scaffolds as potential MAO-A inhibitors using pharmacophore and 3D-QSAR based in silico screening. Bioorg Med Chem Lett 21:2419-24 (2011)  
Target
Name:
Amine oxidase [flavin-containing] A
Synonyms:
AOFA_HUMAN MAO-A Monoamine oxidase Monoamine oxidase type A (MAO A) Monoamine oxidase type A (MAOA)
Type:
Protein
Mol. Mass.:
59689.53
Organism:
Homo sapiens (Human)
Description:
P21397
Residue:
527
  
Inhibitor
Name:
BDBM15586
Synonyms:
N-(2-Phenylethyl),N-methyl-1H-pyrrole-2-carboxamide pyrrole inhibitor 12
Type:
Small organic molecule
Emp. Form.:
C14H16N2O
Mol. Mass.:
228.2896
SMILES:
CN(CCc1ccccc1)C(=O)c1ccc[nH]1
: