Target
Amine oxidase [flavin-containing] A
Ligand
BDBM50168981
Substrate
Meas. Tech.
ChEMBL_739780 (CHEMBL1763606)
Ki
3499451.67±n/a nM
Citation
 Shelke, SMBhosale, SHDash, RCSuryawanshi, MRMahadik, KR Exploration of new scaffolds as potential MAO-A inhibitors using pharmacophore and 3D-QSAR based in silico screening. Bioorg Med Chem Lett 21:2419-24 (2011)  
Target
Name:
Amine oxidase [flavin-containing] A
Synonyms:
AOFA_HUMAN MAO-A Monoamine oxidase Monoamine oxidase type A (MAO A) Monoamine oxidase type A (MAOA)
Type:
Protein
Mol. Mass.:
59689.53
Organism:
Homo sapiens (Human)
Description:
P21397
Residue:
527
  
Inhibitor
Name:
BDBM50168981
Synonyms:
1-(1-Methyl-1H-pyrrol-2-yl)-2-phenyl-2-pyrrolidin-1-yl-ethanone (-)-R | CHEMBL372923
Type:
Small organic molecule
Emp. Form.:
C17H20N2O
Mol. Mass.:
268.3535
SMILES:
Cn1cccc1C(=O)[C@H](N1CCCC1)c1ccccc1
: