Target
Amine oxidase [flavin-containing] A
Ligand
BDBM50273595
Substrate
Meas. Tech.
ChEMBL_739780 (CHEMBL1763606)
Ki
1000000±n/a nM
Citation
 Shelke, SMBhosale, SHDash, RCSuryawanshi, MRMahadik, KR Exploration of new scaffolds as potential MAO-A inhibitors using pharmacophore and 3D-QSAR based in silico screening. Bioorg Med Chem Lett 21:2419-24 (2011)  
Target
Name:
Amine oxidase [flavin-containing] A
Synonyms:
AOFA_HUMAN MAO-A Monoamine oxidase Monoamine oxidase type A (MAO A) Monoamine oxidase type A (MAOA)
Type:
Protein
Mol. Mass.:
59689.53
Organism:
Homo sapiens (Human)
Description:
P21397
Residue:
527
  
Inhibitor
Name:
BDBM50273595
Synonyms:
CHEMBL462097 | N-(1H-Indol-2-ylmethyl)-N-methyl-N-(2-phenethyl)amine
Type:
Small organic molecule
Emp. Form.:
C18H20N2
Mol. Mass.:
264.3648
SMILES:
CN(CCc1ccccc1)Cc1cc2ccccc2[nH]1
: