Target
Amine oxidase [flavin-containing] A
Ligand
BDBM50273487
Substrate
Meas. Tech.
ChEMBL_739780 (CHEMBL1763606)
Ki
99900000±n/a nM
Citation
 Shelke, SMBhosale, SHDash, RCSuryawanshi, MRMahadik, KR Exploration of new scaffolds as potential MAO-A inhibitors using pharmacophore and 3D-QSAR based in silico screening. Bioorg Med Chem Lett 21:2419-24 (2011)  
Target
Name:
Amine oxidase [flavin-containing] A
Synonyms:
AOFA_HUMAN MAO-A Monoamine oxidase Monoamine oxidase type A (MAO A) Monoamine oxidase type A (MAOA)
Type:
Protein
Mol. Mass.:
59689.53
Organism:
Homo sapiens (Human)
Description:
P21397
Residue:
527
  
Inhibitor
Name:
BDBM50273487
Synonyms:
CHEMBL464333 | N-Phenyl-1-methyl-1H-indole-2-carboxamide
Type:
Small organic molecule
Emp. Form.:
C16H14N2O
Mol. Mass.:
250.2952
SMILES:
Cn1c(cc2ccccc12)C(=O)Nc1ccccc1
: