Target
Amine oxidase [flavin-containing] A
Ligand
BDBM50273621
Substrate
Meas. Tech.
ChEMBL_739780 (CHEMBL1763606)
Ki
72945751.03±n/a nM
Citation
 Shelke, SMBhosale, SHDash, RCSuryawanshi, MRMahadik, KR Exploration of new scaffolds as potential MAO-A inhibitors using pharmacophore and 3D-QSAR based in silico screening. Bioorg Med Chem Lett 21:2419-24 (2011)  
Target
Name:
Amine oxidase [flavin-containing] A
Synonyms:
AOFA_HUMAN MAO-A Monoamine oxidase Monoamine oxidase type A (MAO A) Monoamine oxidase type A (MAOA)
Type:
Protein
Mol. Mass.:
59689.53
Organism:
Homo sapiens (Human)
Description:
P21397
Residue:
527
  
Inhibitor
Name:
BDBM50273621
Synonyms:
CHEMBL450824 | N-(1H-Indol-2-ylmethyl)-N-methyl-N-(2-phenylpropyl)amine
Type:
Small organic molecule
Emp. Form.:
C19H22N2
Mol. Mass.:
278.3914
SMILES:
CN(CCCc1ccccc1)Cc1cc2ccccc2[nH]1
: