Target
Amine oxidase [flavin-containing] A
Ligand
BDBM50273659
Substrate
Meas. Tech.
ChEMBL_739780 (CHEMBL1763606)
Ki
53951062.25±n/a nM
Citation
 Shelke, SMBhosale, SHDash, RCSuryawanshi, MRMahadik, KR Exploration of new scaffolds as potential MAO-A inhibitors using pharmacophore and 3D-QSAR based in silico screening. Bioorg Med Chem Lett 21:2419-24 (2011)  
Target
Name:
Amine oxidase [flavin-containing] A
Synonyms:
AOFA_HUMAN MAO-A Monoamine oxidase Monoamine oxidase type A (MAO A) Monoamine oxidase type A (MAOA)
Type:
Protein
Mol. Mass.:
59689.53
Organism:
Homo sapiens (Human)
Description:
P21397
Residue:
527
  
Inhibitor
Name:
BDBM50273659
Synonyms:
(S)-N-(a-Cyclohexylethyl)-N-methyl-1-methyl-1Hindole-2-carboxamide | CHEMBL457235
Type:
Small organic molecule
Emp. Form.:
C19H26N2O
Mol. Mass.:
298.4225
SMILES:
C[C@@H](C1CCCCC1)N(C)C(=O)c1cc2ccccc2n1C
: