Target
Inhibitor of nuclear factor kappa-B kinase subunit beta
Ligand
BDBM50418169
Substrate
Meas. Tech.
ChEMBL_741019 (CHEMBL1764205)
IC50
7.94±n/a nM
Citation
 Miller, DDBamborough, PChristopher, JABaldwin, IRChampigny, ACCutler, GJKerns, JKLongstaff, TMellor, GWMorey, JVMorse, MANie, HRumsey, WLTaggart, JJ 3,5-Disubstituted-indole-7-carboxamides: the discovery of a novel series of potent, selective inhibitors of IKK-ß. Bioorg Med Chem Lett 21:2255-8 (2011)  
Target
Name:
Inhibitor of nuclear factor kappa-B kinase subunit beta
Synonyms:
I-kappa-B Kinase 2 (IKK-beta) I-kappa-B-kinase beta IKBKB IKK-beta IKK2/IKK1 IKKB_HUMAN Inhibitor of nuclear factor kappa B kinase beta subunit Nuclear factor NF-kappa-B inhibitor kinase beta
Type:
Serine/threonine-protein kinase
Mol. Mass.:
86554.39
Organism:
Homo sapiens (Human)
Description:
GST-tagged IKK-2 was expressed in High Five cells and purified.
Residue:
756
  
Inhibitor
Name:
BDBM50418169
Synonyms:
CHEMBL1761516
Type:
Small organic molecule
Emp. Form.:
C14H15N3O2S
Mol. Mass.:
289.353
SMILES:
CCc1ccc(cc1)-c1cc(C(N)=O)c(NC(N)=O)s1
: