Target
5-hydroxytryptamine receptor 1A
Ligand
BDBM50102330
Substrate
Meas. Tech.
ChEMBL_749293 (CHEMBL1785228)
Ki
18.2±n/a nM
Citation
 Weber, KCda Silva, AB A chemometric study of the 5-HT(1A) receptor affinities presented by arylpiperazine compounds. Eur J Med Chem 43:364-72 (2008)  
Target
Name:
5-hydroxytryptamine receptor 1A
Synonyms:
5-HT-1A 5-hydroxytryptamine receptor 1A (5-HT-1A) ADRB2RL1 Dopamine D2 receptor and serotonin 1a receptor HTR1A | Serotonin receptor 1A
Type:
Mol. Mass.:
46122.49
Organism:
Homo sapiens (Human)
Description:
Residue:
422
  
Inhibitor
Name:
BDBM50102330
Synonyms:
2-(4-(3-(benzo[b]thiophen-3-yl)-3-hydroxypropyl)piperazin-1-yl)phenol CHEMBL135890
Type:
Small organic molecule
Emp. Form.:
C21H24N2O2S
Mol. Mass.:
368.492
SMILES:
OC(CCN1CCN(CC1)c1ccccc1O)c1csc2ccccc12
: