Target
Beta-1 adrenergic receptor
Ligand
BDBM50418944
Substrate
Meas. Tech.
ChEMBL_759387 (CHEMBL1810625)
IC50
4±n/a nM
Citation
 Connolly, SAlcaraz, LBailey, ACadogan, EChristie, JCook, ARFisher, AJHill, SHumphries, AIngall, AHKane, ZPaine, SPairaudeau, GStocks, MJYoung, A Design-driven LO: the discovery of new ultra long acting dibasicß2-adrenoceptor agonists. Bioorg Med Chem Lett 21:4612-6 (2011)  
Target
Name:
Beta-1 adrenergic receptor
Synonyms:
ADRB1 ADRB1_HUMAN Beta-1 adrenoceptor adrenergic Beta1
Type:
G Protein-Coupled Receptor (GPCR)
Mol. Mass.:
51338.40
Organism:
Homo sapiens (Human)
Description:
P08588
Residue:
477
  
Inhibitor
Name:
BDBM50418944
Synonyms:
CHEMBL1807819
Type:
Small organic molecule
Emp. Form.:
C23H30N2O4S2
Mol. Mass.:
462.625
SMILES:
O[C@@H](CNCCCSCCCOCCc1ccccc1)c1ccc(O)c2[nH]c(=O)sc12
: