Target
Histamine H1 receptor
Ligand
BDBM22567
Substrate
Meas. Tech.
ChEMBL_775967 (CHEMBL1912710)
Kd
0.851±n/a nM
Citation
 Wagner, EWittmann, HJElz, SStrasser, A Mepyramine-JNJ7777120-hybrid compounds show high affinity to hH(1)R, but low affinity to hH(4)R. Bioorg Med Chem Lett 21:6274-80 (2011)  
Target
Name:
Histamine H1 receptor
Synonyms:
HISTAMINE H1 HRH1_CAVPO
Type:
G Protein-Coupled Receptor (GPCR)
Mol. Mass.:
55641.53
Organism:
Cavia porcellus (domestic guinea pig)
Description:
Guinea pig cerebellum was used in binding assay.
Residue:
488
  
Inhibitor
Name:
BDBM22567
Synonyms:
3H]pyrilamine Dorantamin N-(4-methoxybenzyl)-N ,N -dimethyl-N-pyridin-2-ylethane-1,2-diamine PYRILAMINE [3H]mepyramine | [3H]pyrilamine
Type:
radiolabeled ligand
Emp. Form.:
C17H23N3O
Mol. Mass.:
285.384
SMILES:
COc1ccc(CN(CCN(C)C)c2ccccn2)cc1
: