Target
B2 bradykinin receptor
Ligand
BDBM50419899
Substrate
Meas. Tech.
ChEMBL_806222 (CHEMBL1958763)
Kd
2.51±n/a nM
Citation
 Fincham, CIBressan, AD'Andrea, PEttorre, AGiuliani, SMauro, SMeini, SParis, MQuartara, LRossi, CSquarcia, AValenti, CDaniela, FMaggi, CA Design and synthesis of novel sulfonamide-containing bradykinin hB(2) receptor antagonists. Synthesis and structure-relationships ofa,a-tetrahydropyranylglycine. Bioorg Med Chem 20:2091-100 (2012)  
Target
Name:
B2 bradykinin receptor
Synonyms:
B2 BRADYKININ B2R BK-2 receptor BKRB2_HUMAN | Bradykinin B2 receptor
Type:
Enzyme Catalytic Domain
Mol. Mass.:
44467.17
Organism:
Homo sapiens (Human)
Description:
B2 BRADYKININ BDKRB2 HUMAN::P30411
Residue:
391
  
Inhibitor
Name:
BDBM50419899
Synonyms:
CHEMBL1956876
Type:
Small organic molecule
Emp. Form.:
C37H52Cl2N5O5S
Mol. Mass.:
749.81
SMILES:
Cc1cc(C)c2cccc(OCc3c(Cl)ccc(c3Cl)S(=O)(=O)NC3(CCOCC3)C(=O)N3CCC(CNCCCC[N+](C)(C)C)CC3)c2n1
: