Target
B2 bradykinin receptor
Ligand
BDBM50419910
Substrate
Meas. Tech.
ChEMBL_806222 (CHEMBL1958763)
Kd
0.398±n/a nM
Citation
 Fincham, CIBressan, AD'Andrea, PEttorre, AGiuliani, SMauro, SMeini, SParis, MQuartara, LRossi, CSquarcia, AValenti, CDaniela, FMaggi, CA Design and synthesis of novel sulfonamide-containing bradykinin hB(2) receptor antagonists. Synthesis and structure-relationships ofa,a-tetrahydropyranylglycine. Bioorg Med Chem 20:2091-100 (2012)  
Target
Name:
B2 bradykinin receptor
Synonyms:
B2 BRADYKININ B2R BK-2 receptor BKRB2_HUMAN | Bradykinin B2 receptor
Type:
Enzyme Catalytic Domain
Mol. Mass.:
44467.17
Organism:
Homo sapiens (Human)
Description:
B2 BRADYKININ BDKRB2 HUMAN::P30411
Residue:
391
  
Inhibitor
Name:
BDBM50419910
Synonyms:
CHEMBL1956859
Type:
Small organic molecule
Emp. Form.:
C37H51Cl2N6O6S
Mol. Mass.:
778.808
SMILES:
Cc1cc(C)c2cccc(OCc3c(Cl)ccc(c3Cl)S(=O)(=O)NC3(CCOCC3)C(=O)N3CCN(CC3)C(=O)[C@@H](N)CCCC[N+](C)(C)C)c2n1
: