Target
Multidrug resistance-associated protein 1
Ligand
BDBM67690
Substrate
Meas. Tech.
ChEMBL_838654 (CHEMBL2078385)
IC50
1.5±n/a nM
Citation
 Morrow, CSPeklak-Scott, CBishwokarma, BKute, TESmitherman, PKTownsend, AJ Multidrug resistance protein 1 (MRP1, ABCC1) mediates resistance to mitoxantrone via glutathione-dependent drug efflux. Mol Pharmacol 69:1499-505 (2006)  
Target
Name:
Multidrug resistance-associated protein 1
Synonyms:
7.6.2.2 ABCC1 ATP-binding cassette, sub-family C, member 1 isoform 1 LTC4 transporter MRP MRP1_HUMAN
Type:
Mol. Mass.:
171597.72
Organism:
Homo sapiens (Human)
Description:
P33527
Residue:
1531
  
Inhibitor
Name:
BDBM67690
Synonyms:
1,4-bis[2-(2-hydroxyethylamino)ethylamino]-5,8-bis(oxidanyl)anthracene-9,10-dione;hydrochloride 1,4-dihydroxy-5,8-bis[2-(2-hydroxyethylamino)ethylamino]anthracene-9,10-dione;hydrochloride MITOXANTRONE MLS001333711 cid_4212 | cid_5458171
Type:
Small organic molecule
Emp. Form.:
C22H28N4O6
Mol. Mass.:
444.4809
SMILES:
OCCNCCNc1ccc(NCCNCCO)c2C(=O)c3c(O)ccc(O)c3C(=O)c12
: