Target
Solute carrier family 22 member 3
Ligand
BDBM50149890
Substrate
Meas. Tech.
ChEMBL_836621 (CHEMBL2077362)
IC50
10300000±n/a nM
Citation
 Martel, FGründemann, DCalhau, CSchömig, E Apical uptake of organic cations by human intestinal Caco-2 cells: putative involvement of ASF transporters. Naunyn Schmiedebergs Arch Pharmacol 363:40-9 (2001)  
Target
Name:
Solute carrier family 22 member 3
Synonyms:
EMT Extraneuronal monoamine transporter Organic cation transporter 3 SLC22A3
Type:
PROTEIN
Mol. Mass.:
61292.57
Organism:
Homo sapiens (Human)
Description:
ChEMBL_934315
Residue:
556
  
Inhibitor
Name:
BDBM50149890
Synonyms:
CHEMBL9324 | tetraethylammonium
Type:
Small organic molecule
Emp. Form.:
C8H20N
Mol. Mass.:
130.2506
SMILES:
CC[N+](CC)(CC)CC
: