Target
Solute carrier family 22 member 2
Ligand
BDBM50149890
Substrate
Meas. Tech.
ChEMBL_836299 (CHEMBL2076312)
IC50
156000±n/a nM
Citation
 Dresser, MJXiao, GLeabman, MKGray, ATGiacomini, KM Interactions of n-tetraalkylammonium compounds and biguanides with a human renal organic cation transporter (hOCT2). Pharm Res 19:1244-7 (2002)  
Target
Name:
Solute carrier family 22 member 2
Synonyms:
OCT2 S22A2_HUMAN hOCT2
Type:
PROTEIN
Mol. Mass.:
62591.01
Organism:
Homo sapiens (Human)
Description:
ChEMBL_1484077
Residue:
555
  
Inhibitor
Name:
BDBM50149890
Synonyms:
CHEMBL9324 | tetraethylammonium
Type:
Small organic molecule
Emp. Form.:
C8H20N
Mol. Mass.:
130.2506
SMILES:
CC[N+](CC)(CC)CC
: