Target
Ricin
Ligand
BDBM50420411
Substrate
Meas. Tech.
ChEMBL_840713 (CHEMBL2090455)
IC50
15000±n/a nM
Citation
 Pruet, JMSaito, RManzano, LAJasheway, KRWiget, PAKamat, IAnslyn, EVRobertus, JD Optimized 5-membered heterocycle-linked pterins for the inhibition of Ricin Toxin A. ACS Med Chem Lett 3:588-591 (2012)  
Target
Name:
Ricin
Synonyms:
RICI_RICCO
Type:
PROTEIN
Mol. Mass.:
64090.82
Organism:
Ricinus communis
Description:
ChEMBL_1286970
Residue:
576
  
Inhibitor
Name:
BDBM50420411
Synonyms:
CHEMBL2089319
Type:
Small organic molecule
Emp. Form.:
C17H15N9O2S
Mol. Mass.:
409.425
SMILES:
Nc1nc2nc(cnc2c(=O)[nH]1)C(=O)NCc1cn(CSc2ccccc2)nn1
: