Target
Caspase-3
Ligand
BDBM10352
Substrate
Meas. Tech.
ChEMBL_842368 (CHEMBL2091985)
IC50
4.37±n/a nM
Citation
 Hasegawa, KFunatsu, K New description of protein-ligand interactions using a spherical self-organizing map. Bioorg Med Chem 20:5410-5 (2012)  
Target
Name:
Caspase-3
Synonyms:
Apopain CASP3 CPP-32 Caspase 3 Caspase-3 subunit p17 SCA-1 Yama protein | caspase-3 preproprotein
Type:
Hydrolase; heterotetramer of two heterodimers
Mol. Mass.:
31607.55
Organism:
Homo sapiens (Human)
Description:
Residue:
277
  
Inhibitor
Name:
BDBM10352
Synonyms:
1-(4-Methylthiobenzyl)-5-(2-(pyridin-3-yl-oxymethyl)-pyrrolidine-1-sulfonyl)-1H-indole-2,3-dione Pyridine Analogue 21d
Type:
Small organic molecule
Emp. Form.:
C26H25N3O5S2
Mol. Mass.:
523.624
SMILES:
CSc1ccc(CN2C(=O)C(=O)c3cc(ccc23)S(=O)(=O)N2CCC[C@H]2COc2cccnc2)cc1
: