Target
5-hydroxytryptamine receptor 1D
Ligand
BDBM10755
Substrate
Meas. Tech.
ChEBML_1963
IC50
10.0±n/a nM
Citation
 Castro, JLMatassa, VGBroughton, HBMosley, RTStreet, LJBaker, R Synthesis, biological activity and electrostatic properties of 3-[2-(dimethylamino)ethyl]-5-[(3-amino-1,2,4-thiadiazol-5-yl)methyl]-1H-indole, a novel 5-HT1D receptor agonist. Bioorg Med Chem Lett 3:993-997 (1993)    Article 
Target
Name:
5-hydroxytryptamine receptor 1D
Synonyms:
5HT1D_PIG Serotonin 1d (5-HT1d) receptor
Type:
PROTEIN
Mol. Mass.:
32680.56
Organism:
Sus scrofa
Description:
ChEMBL_1963
Residue:
291
  
Inhibitor
Name:
BDBM10755
Synonyms:
14C-5-hydroxy tryptamine creatinine disulfate 5-HT 5-hydroxy tryptamine creatinine disulfate Serotonin | [3H]-5-HT
Type:
Small organic molecule
Emp. Form.:
C10H12N2O
Mol. Mass.:
176.2151
SMILES:
NCCc1c[nH]c2ccc(O)cc12
: