Target
Serine/threonine-protein kinase mTOR
Ligand
BDBM50217621
Substrate
Meas. Tech.
ChEMBL_66425 (CHEMBL682171)
IC50
<10000±n/a nM
Citation
 Rabinowitz, MSeneci, PRossi, TDal Cin, MDeal, MTerstappen, G Solid-phase/solution-phase combinatorial synthesis of neuroimmunophilin ligands. Bioorg Med Chem Lett 10:1007-10 (2000)  
Target
Name:
Serine/threonine-protein kinase mTOR
Synonyms:
FK506-binding protein 12-rapamycin complex-associated protein 1 FRAP FRAP1 MTOR Mammalian Target of Rapamycin (mTOR) RAFT1 Rapamycin and FKBP12 target 1 Serine/threonine-protein kinase (mTOR) | mTORC2
Type:
Rapamycin target protein
Mol. Mass.:
288917.12
Organism:
Homo sapiens (Human)
Description:
P42345
Residue:
2549
  
Inhibitor
Name:
BDBM50217621
Synonyms:
CHEMBL269775
Type:
Small organic molecule
Emp. Form.:
C19H32N2O4
Mol. Mass.:
352.4684
SMILES:
CC(CN1CCCCC1)OC(=O)[C@@H]1CCCN1C(=O)C(=O)C(C)(C)C
: