Target
Serine/threonine-protein kinase mTOR
Ligand
BDBM50030448
Substrate
Meas. Tech.
ChEBML_66424
IC50
3.2±n/a nM
Citation
 Rabinowitz, MSeneci, PRossi, TDal Cin, MDeal, MTerstappen, G Solid-phase/solution-phase combinatorial synthesis of neuroimmunophilin ligands. Bioorg Med Chem Lett 10:1007-10 (2000)  
Target
Name:
Serine/threonine-protein kinase mTOR
Synonyms:
FK506-binding protein 12-rapamycin complex-associated protein 1 FRAP FRAP1 MTOR Mammalian Target of Rapamycin (mTOR) RAFT1 Rapamycin and FKBP12 target 1 Serine/threonine-protein kinase (mTOR) | mTORC2
Type:
Rapamycin target protein
Mol. Mass.:
288917.12
Organism:
Homo sapiens (Human)
Description:
P42345
Residue:
2549
  
Inhibitor
Name:
BDBM50030448
Synonyms:
8-DEETHYL-8-[BUT-3-ENYL]-ASCOMYCIN TACROLIMUS
Type:
Small organic molecule
Emp. Form.:
C44H69NO12
Mol. Mass.:
804.0182
SMILES:
CO[C@@H]1C[C@@H](CC[C@H]1O)\C=C(/C)[C@H]1OC(=O)[C@@H]2CCCCN2C(=O)C(=O)[C@]2(O)O[C@@H]([C@H](C[C@H]2C)OC)[C@H](C[C@@H](C)C\C(C)=C\[C@@H](CC=C)C(=O)C[C@H](O)[C@H]1C)OC
: