Target
Serine/threonine-protein kinase mTOR
Ligand
BDBM23334
Substrate
Meas. Tech.
ChEBML_66424
IC50
20893±n/a nM
Citation
 Rabinowitz, MSeneci, PRossi, TDal Cin, MDeal, MTerstappen, G Solid-phase/solution-phase combinatorial synthesis of neuroimmunophilin ligands. Bioorg Med Chem Lett 10:1007-10 (2000)  
Target
Name:
Serine/threonine-protein kinase mTOR
Synonyms:
FK506-binding protein 12-rapamycin complex-associated protein 1 FRAP FRAP1 MTOR Mammalian Target of Rapamycin (mTOR) RAFT1 Rapamycin and FKBP12 target 1 Serine/threonine-protein kinase (mTOR) | mTORC2
Type:
Rapamycin target protein
Mol. Mass.:
288917.12
Organism:
Homo sapiens (Human)
Description:
P42345
Residue:
2549
  
Inhibitor
Name:
BDBM23334
Synonyms:
3-(pyridin-3-yl)propyl (2S)-1-(3,3-dimethyl-2-oxopentanoyl)pyrrolidine-2-carboxylate GPI 1046
Type:
Small organic molecule
Emp. Form.:
C20H28N2O4
Mol. Mass.:
360.4473
SMILES:
CCC(C)(C)C(=O)C(=O)N1CCC[C@H]1C(=O)OCCCc1cccnc1
: