Target
Integrin alpha-4/beta-1
Ligand
BDBM50088995
Substrate
Meas. Tech.
ChEBML_217441
IC50
47±n/a nM
Citation
 Archibald, SCHead, JCLinsley, JMPorter, JRRobinson, MKShock, AWarrellow, GJ Discovery and evaluation of potent, cysteine-based alpha4beta1 integrin antagonists. Bioorg Med Chem Lett 10:993-5 (2000)  
Target
Name:
Integrin alpha-4/beta-1
Synonyms:
Fibronectin receptor beta/Integrin alpha-4 | Integrin alpha-4/beta-1
Type:
Mol. Mass.:
Description:
ASSAY_ID of EBI is 88912
Components:
This complex has 2 components.
Component 1
Name:
Integrin beta-1
Synonyms:
CD_antigen=CD29 Fibronectin receptor beta GPIIA ITGB1 MDF2 | MSK12
Type:
Enzyme
Mol. Mass.:
88400.38
Organism:
Homo sapiens (Human)
Description:
P05556
Residue:
798
  
Component 2
Name:
Integrin alpha-4
Synonyms:
CD49 antigen-like family member D CD49d antigen ITA4_HUMAN Integrin alpha-4 Integrin alpha-IV VLA-4 integrin alpha 4 precursor | integrin alpha-4 precursor
Type:
Membrane Protein
Mol. Mass.:
114897.35
Organism:
Homo sapiens (Human)
Description:
P13612
Residue:
1032
  
Inhibitor
Name:
BDBM50088995
Synonyms:
(5S,8R,13R,15aR)-8-[(Adamantane-1-carbonyl)-amino]-5-carboxymethyl-7,15-dioxo-decahydro-2,10,11-trithia-3a,6,14-triaza-cyclopentacyclotetradecene-13-carboxylic acid | CHEMBL273620
Type:
Small organic molecule
Emp. Form.:
C25H36N4O7S3
Mol. Mass.:
600.771
SMILES:
OC(=O)C[C@H]1CN2CSC[C@H]2C(=O)N[C@@H](CSSC[C@H](NC(=O)C23CC4CC(CC(C4)C2)C3)C(=O)N1)C(O)=O
: