Target
Integrin alpha-4/beta-1
Ligand
BDBM50088991
Substrate
Meas. Tech.
ChEBML_217441
IC50
425±n/a nM
Citation
 Archibald, SCHead, JCLinsley, JMPorter, JRRobinson, MKShock, AWarrellow, GJ Discovery and evaluation of potent, cysteine-based alpha4beta1 integrin antagonists. Bioorg Med Chem Lett 10:993-5 (2000)  
Target
Name:
Integrin alpha-4/beta-1
Synonyms:
Fibronectin receptor beta/Integrin alpha-4 | Integrin alpha-4/beta-1
Type:
Mol. Mass.:
Description:
ASSAY_ID of EBI is 88912
Components:
This complex has 2 components.
Component 1
Name:
Integrin beta-1
Synonyms:
CD_antigen=CD29 Fibronectin receptor beta GPIIA ITGB1 MDF2 | MSK12
Type:
Enzyme
Mol. Mass.:
88400.38
Organism:
Homo sapiens (Human)
Description:
P05556
Residue:
798
  
Component 2
Name:
Integrin alpha-4
Synonyms:
CD49 antigen-like family member D CD49d antigen ITA4_HUMAN Integrin alpha-4 Integrin alpha-IV VLA-4 integrin alpha 4 precursor | integrin alpha-4 precursor
Type:
Membrane Protein
Mol. Mass.:
114897.35
Organism:
Homo sapiens (Human)
Description:
P13612
Residue:
1032
  
Inhibitor
Name:
BDBM50088991
Synonyms:
(R)-2-[((S)-1-Acetyl-piperidine-2-carbonyl)-amino]-3-{2-[(adamantane-1-carbonyl)-amino]-ethyldisulfanyl}-propionic acid | CHEMBL369656
Type:
Small organic molecule
Emp. Form.:
C24H37N3O5S2
Mol. Mass.:
511.698
SMILES:
CC(=O)N1CCCC[C@H]1C(=O)N[C@@H](CSSCCNC(=O)C12CC3CC(CC(C3)C1)C2)C(O)=O
: