Target
Sodium-dependent serotonin transporter
Ligand
BDBM50421561
Substrate
Meas. Tech.
ChEBML_202151
IC50
251±n/a nM
Citation
 Ryckmans, TBerton, OGrimée, RKogej, TLamberty, YPasau, PTalaga, PGenicot, C Dual NK(1) antagonists--serotonin reuptake inhibitors as potential antidepressants. Part 2: SAR and activity of benzyloxyphenethyl piperazine derivatives. Bioorg Med Chem Lett 12:3195-8 (2002)  
Target
Name:
Sodium-dependent serotonin transporter
Synonyms:
5-HT Transporter 5HT transporter Anandamid membrane transporter, AMT Monoamine transporters; Norepinephrine & serotonin Slc6a4 Sodium-dependent serotonin transporter (SERT) | imipramine receptor
Type:
Multi-pass membrane protein
Mol. Mass.:
70168.43
Organism:
Rattus norvegicus (rat)
Description:
P31652
Residue:
630
  
Inhibitor
Name:
BDBM50421561
Synonyms:
CHEMBL419742
Type:
Small organic molecule
Emp. Form.:
C21H21ClF6N2O
Mol. Mass.:
466.848
SMILES:
FC(F)(F)c1cc(COCC(N2CCNCC2)c2cccc(Cl)c2)cc(c1)C(F)(F)F
: