Target
Beta-3 adrenergic receptor
Ligand
BDBM50421589
Substrate
Meas. Tech.
ChEMBL_33813 (CHEMBL647197)
IC50
<1000±n/a nM
Citation
 Andrés, JIAlonso, JMFernández, JIturrino, LMartínez, PMeert, TFSipido, VK 2-(Dimethylaminomethyl)-tetrahydroisoxazolopyridobenzazepine derivatives. Synthesis of a new 5-HT(2C) antagonist with potential anxiolytic properties. Bioorg Med Chem Lett 12:3573-7 (2002)  
Target
Name:
Beta-3 adrenergic receptor
Synonyms:
ADRB3 ADRB3_HUMAN Beta-2 adrenergic receptor and beta-3 adrenergic receptor Beta-3 adrenoreceptor | adrenergic Beta3
Type:
G Protein-Coupled Receptor (GPCR)
Mol. Mass.:
43534.88
Organism:
Homo sapiens (Human)
Description:
Residue:
408
  
Inhibitor
Name:
BDBM50421589
Synonyms:
CHEMBL331077
Type:
Small organic molecule
Emp. Form.:
C18H21N3O
Mol. Mass.:
295.3788
SMILES:
CN(C)CC1CC2N(O1)c1cnccc1Cc1ccccc21
: