Target
Beta-3 adrenergic receptor
Ligand
BDBM50146360
Substrate
Meas. Tech.
ChEBML_33813
IC50
1862±n/a nM
Citation
 Andrés, JIAlonso, JMFernández, JIturrino, LMartínez, PMeert, TFSipido, VK 2-(Dimethylaminomethyl)-tetrahydroisoxazolopyridobenzazepine derivatives. Synthesis of a new 5-HT(2C) antagonist with potential anxiolytic properties. Bioorg Med Chem Lett 12:3573-7 (2002)  
Target
Name:
Beta-3 adrenergic receptor
Synonyms:
ADRB3 ADRB3_HUMAN Beta-2 adrenergic receptor and beta-3 adrenergic receptor Beta-3 adrenoreceptor | adrenergic Beta3
Type:
G Protein-Coupled Receptor (GPCR)
Mol. Mass.:
43534.88
Organism:
Homo sapiens (Human)
Description:
Residue:
408
  
Inhibitor
Name:
BDBM50146360
Synonyms:
CHEMBL328573 | Dimethyl-[(2S,3aR)-1-(2,3,3a,8-tetrahydro-1-oxa-12b-aza-dibenzo[e,h]azulen-2-yl)methyl]-amine
Type:
Small organic molecule
Emp. Form.:
C19H22N2O
Mol. Mass.:
294.3908
SMILES:
CN(C)C[C@@H]1C[C@H]2N(O1)c1ccccc1Cc1ccccc21
: