Target
Integrin alpha-4/beta-1
Ligand
BDBM50060206
Substrate
Meas. Tech.
ChEMBL_217297 (CHEMBL873402)
IC50
160±n/a nM
Citation
 Jackson, DYQuan, CArtis, DRRawson, TBlackburn, BStruble, MFitzgerald, GChan, KMullins, SBurnier, JPFairbrother, WJClark, KBerisini, MChui, HRenz, MJones, SFong, S Potent alpha 4 beta 1 peptide antagonists as potential anti-inflammatory agents. J Med Chem 40:3359-68 (1997)  
Target
Name:
Integrin alpha-4/beta-1
Synonyms:
Fibronectin receptor beta/Integrin alpha-4 | Integrin alpha-4/beta-1
Type:
Mol. Mass.:
Description:
ASSAY_ID of EBI is 88912
Components:
This complex has 2 components.
Component 1
Name:
Integrin beta-1
Synonyms:
CD_antigen=CD29 Fibronectin receptor beta GPIIA ITGB1 MDF2 | MSK12
Type:
Enzyme
Mol. Mass.:
88400.38
Organism:
Homo sapiens (Human)
Description:
P05556
Residue:
798
  
Component 2
Name:
Integrin alpha-4
Synonyms:
CD49 antigen-like family member D CD49d antigen ITA4_HUMAN Integrin alpha-4 Integrin alpha-IV VLA-4 integrin alpha 4 precursor | integrin alpha-4 precursor
Type:
Membrane Protein
Mol. Mass.:
114897.35
Organism:
Homo sapiens (Human)
Description:
P13612
Residue:
1032
  
Inhibitor
Name:
BDBM50060206
Synonyms:
(4R,9R)-4-[(S)-2-Amino-3-(4-hydroxy-phenyl)-propionylamino]-3,11-dioxo-6,7-dithia-2,10-diaza-bicyclo[10.2.2]hexadeca-1(15),12(16),13-triene-9-carboxylic acid | CHEMBL439598
Type:
Small organic molecule
Emp. Form.:
C22H24N4O6S2
Mol. Mass.:
504.579
SMILES:
N[C@@H](Cc1ccc(O)cc1)C(=O)N[C@H]1CSSC[C@H](NC(=O)c2ccc(NC1=O)cc2)C(O)=O
: