Target
Integrin alpha-4/beta-1
Ligand
BDBM50060173
Substrate
Meas. Tech.
ChEMBL_217297 (CHEMBL873402)
IC50
5±n/a nM
Citation
 Jackson, DYQuan, CArtis, DRRawson, TBlackburn, BStruble, MFitzgerald, GChan, KMullins, SBurnier, JPFairbrother, WJClark, KBerisini, MChui, HRenz, MJones, SFong, S Potent alpha 4 beta 1 peptide antagonists as potential anti-inflammatory agents. J Med Chem 40:3359-68 (1997)  
Target
Name:
Integrin alpha-4/beta-1
Synonyms:
Fibronectin receptor beta/Integrin alpha-4 | Integrin alpha-4/beta-1
Type:
Mol. Mass.:
Description:
ASSAY_ID of EBI is 88912
Components:
This complex has 2 components.
Component 1
Name:
Integrin beta-1
Synonyms:
CD_antigen=CD29 Fibronectin receptor beta GPIIA ITGB1 MDF2 | MSK12
Type:
Enzyme
Mol. Mass.:
88400.38
Organism:
Homo sapiens (Human)
Description:
P05556
Residue:
798
  
Component 2
Name:
Integrin alpha-4
Synonyms:
CD49 antigen-like family member D CD49d antigen ITA4_HUMAN Integrin alpha-4 Integrin alpha-IV VLA-4 integrin alpha 4 precursor | integrin alpha-4 precursor
Type:
Membrane Protein
Mol. Mass.:
114897.35
Organism:
Homo sapiens (Human)
Description:
P13612
Residue:
1032
  
Inhibitor
Name:
BDBM50060173
Synonyms:
(5S,8R,13R,15aS)-8-[(S)-2-Amino-3-(4-hydroxy-phenyl)-propionylamino]-2-hydroxy-5-methyl-4,7,15-trioxo-tetradecahydro-10,11-dithia-3a,6,14-triaza-cyclopentacyclotetradecene-13-carboxylic acid | CHEMBL2370461
Type:
Small organic molecule
Emp. Form.:
C23H31N5O8S2
Mol. Mass.:
569.651
SMILES:
[H][C@@]12C[C@@H](O)CN1C(=O)[C@H](C)NC(=O)[C@H](CSSC[C@H](NC2=O)C(O)=O)NC(=O)[C@@H](N)Cc1ccc(O)cc1
: