Target
Acetylcholinesterase
Ligand
BDBM50067482
Substrate
Meas. Tech.
ChEMBL_28898 (CHEMBL638447)
IC50
170±n/a nM
Citation
 Bolognesi, MLBixel, MGMarucci, GBartolini, MKrauss, MAngeli, PAntonello, ARosini, MTumiatti, VHucho, FMelchiorre, C Structure-activity relationships of methoctramine-related polyamines as muscular nicotinic receptor noncompetitive antagonists. 3. Effect of inserting the tetraamine backbone into a macrocyclic structure. J Med Chem 45:3286-95 (2002)  
Target
Name:
Acetylcholinesterase
Synonyms:
ACES_HUMAN Acetylcholinesterase (AChE) | Acetylcholinesterase (human AChE)
Type:
Enzyme
Mol. Mass.:
67792.70
Organism:
Homo sapiens (Human)
Description:
P22303
Residue:
614
  
Inhibitor
Name:
BDBM50067482
Synonyms:
6-[(2-Methoxy-benzyl)-methyl-amino]-hexanoic acid [8-({6-[(2-methoxy-benzyl)-methyl-amino]-hexanoyl}-methyl-amino)-octyl]-methyl-amide CHEMBL11805 CHEMBL557586 | N,N''-(octane-1,8-diyl)bis(6-((2-methoxybenzyl)(methyl)amino)-N-methylhexanamide)
Type:
Small organic molecule
Emp. Form.:
C40H66N4O4
Mol. Mass.:
666.9764
SMILES:
COc1ccccc1CN(C)CCCCCC(=O)N(C)CCCCCCCCN(C)C(=O)CCCCCN(C)Cc1ccccc1OC
: