Target
Acetylcholinesterase
Ligand
BDBM50422400
Substrate
Meas. Tech.
ChEMBL_28898 (CHEMBL638447)
IC50
33113±n/a nM
Citation
 Bolognesi, MLBixel, MGMarucci, GBartolini, MKrauss, MAngeli, PAntonello, ARosini, MTumiatti, VHucho, FMelchiorre, C Structure-activity relationships of methoctramine-related polyamines as muscular nicotinic receptor noncompetitive antagonists. 3. Effect of inserting the tetraamine backbone into a macrocyclic structure. J Med Chem 45:3286-95 (2002)  
Target
Name:
Acetylcholinesterase
Synonyms:
ACES_HUMAN Acetylcholinesterase (AChE) | Acetylcholinesterase (human AChE)
Type:
Enzyme
Mol. Mass.:
67792.70
Organism:
Homo sapiens (Human)
Description:
P22303
Residue:
614
  
Inhibitor
Name:
BDBM50422400
Synonyms:
CHEMBL323655
Type:
Small organic molecule
Emp. Form.:
C36H58N4O4
Mol. Mass.:
610.8701
SMILES:
COc1ccccc1CN(CCCCCCCCN(Cc1ccccc1OC)C(=O)CCCCCN)C(=O)CCCCCN
: