Target
Delta-type opioid receptor
Ligand
BDBM50422808
Substrate
Meas. Tech.
ChEMBL_334062 (CHEMBL861271)
IC50
0.158±n/a nM
Citation
 Middleton, DSMaw, GNChallenger, CJessiman, AJohnson, PSMillion, WANichols, CLPrice, JATrevethick, M Highly potent and selective zwitterionic agonists of the delta-opioid receptor. Part 1. Bioorg Med Chem Lett 16:905-10 (2006)  
Target
Name:
Delta-type opioid receptor
Synonyms:
DOR-1 MSL-2 OPRD_MOUSE Oprd1
Type:
Enzyme Catalytic Domain
Mol. Mass.:
40577.25
Organism:
MOUSE
Description:
P32300
Residue:
372
  
Inhibitor
Name:
BDBM50422808
Synonyms:
CHEMBL380737
Type:
Small organic molecule
Emp. Form.:
C28H32N2O3
Mol. Mass.:
444.5653
SMILES:
C[C@@H]1CN([C@H](c2ccc(CC(O)=O)cc2)c2cccc(O)c2)[C@@H](C)CN1Cc1ccccc1
: