Target
Metabotropic glutamate receptor 1
Ligand
BDBM50422825
Substrate
Meas. Tech.
ChEMBL_337695 (CHEMBL867698)
IC50
20±n/a nM
Citation
 Micheli, FCavanni, PDi Fabio, RMarchioro, CDonati, DFaedo, SMaffeis, MSabbatini, FMTranquillini, ME From pyrroles to pyrrolo[1,2-a]pyrazinones: a new class of mGluR1 antagonists. Bioorg Med Chem Lett 16:1342-5 (2006)  
Target
Name:
Metabotropic glutamate receptor 1
Synonyms:
GRM1_RAT Grm1 Metabotropic glutamate receptor Mglur1 metabotropic glutamate 1/5-D metabotropic glutamate receptor 1 isoform alpha precursor
Type:
Enzyme Catalytic Domain
Mol. Mass.:
133240.47
Organism:
RAT
Description:
metabotropic glutamate 1/2 0 RAT::P23385
Residue:
1199
  
Inhibitor
Name:
BDBM50422825
Synonyms:
CHEMBL444359
Type:
Small organic molecule
Emp. Form.:
C19H28N2O3
Mol. Mass.:
332.4372
SMILES:
CC(OC(=O)c1cn2CCN(CC3CC3)C(=O)c2c1C)C(C)(C)C
: