Target
Lanosterol synthase
Ligand
BDBM50130771
Substrate
Meas. Tech.
ChEMBL_446074 (CHEMBL895169)
IC50
32±n/a nM
Citation
 Caron, GErmondi, G Influence of conformation on GRIND-based three-dimensional quantitative structure-activity relationship (3D-QSAR). J Med Chem 50:5039-42 (2007)  
Target
Name:
Lanosterol synthase
Synonyms:
2,3-epoxysqualene--lanosterol cyclase LSS_HUMAN Oxidosqualene--lanosterol cyclase
Type:
PROTEIN
Mol. Mass.:
83309.32
Organism:
Homo sapiens (Human)
Description:
ChEMBL_11231
Residue:
732
  
Inhibitor
Name:
BDBM50130771
Synonyms:
(4-Bromo-phenyl)-{4-[6-(cyclopropylmethyl-methyl-amino)-hexyloxy]-phenyl}-methanone; fumarate CHEMBL611756
Type:
Small organic molecule
Emp. Form.:
C24H30BrNO2
Mol. Mass.:
444.405
SMILES:
CN(CCCCCCOc1ccc(cc1)C(=O)c1ccc(Br)cc1)CC1CC1
: