Target
Collagenase 3
Ligand
BDBM50096463
Substrate
Meas. Tech.
ChEMBL_458933 (CHEMBL924952)
IC50
7.9±n/a nM
Citation
 Verma, RPHansch, C Matrix metalloproteinases (MMPs): chemical-biological functions and (Q)SARs. Bioorg Med Chem 15:2223-68 (2007)  
Target
Name:
Collagenase 3
Synonyms:
MMP-13 MMP13_HUMAN Matrix metalloproteinase-13 (MMP-13) | Matrix metalloproteinase-13 (MMP13)
Type:
Enzyme
Mol. Mass.:
53808.06
Organism:
Homo sapiens (Human)
Description:
P45452
Residue:
471
  
Inhibitor
Name:
BDBM50096463
Synonyms:
CHEMBL70176 N-hydroxy-2-(4-methoxy-N-(pyridin-3-ylmethyl)phenylsulfonamido)-3-methylbenzamide
Type:
Small organic molecule
Emp. Form.:
C21H21N3O5S
Mol. Mass.:
427.474
SMILES:
COc1ccc(cc1)S(=O)(=O)N(Cc1cccnc1)c1c(C)cccc1C(=O)NO
: