Target
Sex hormone-binding globulin
Ligand
BDBM50423498
Substrate
Meas. Tech.
ChEMBL_466706 (CHEMBL922711)
Kd
832±n/a nM
Citation
 Cherkasov, ABan, FSantos-Filho, OThorsteinson, NFallahi, MHammond, GL An updated steroid benchmark set and its application in the discovery of novel nanomolar ligands of sex hormone-binding globulin. J Med Chem 51:2047-56 (2008)  
Target
Name:
Sex hormone-binding globulin
Synonyms:
SHBG Testis-specific androgen-binding protein
Type:
PROTEIN
Mol. Mass.:
43780.19
Organism:
Homo sapiens (Human)
Description:
ChEMBL_466706
Residue:
402
  
Inhibitor
Name:
BDBM50423498
Synonyms:
CHEMBL265940 | ZINC 00334865
Type:
Small organic molecule
Emp. Form.:
C14H10O3
Mol. Mass.:
226.2274
SMILES:
Oc1ccc(cc1)-c1cc2ccc(O)cc2o1
: