Target
Carbonic anhydrase 2
Ligand
BDBM81918
Substrate
Meas. Tech.
ChEMBL_698608 (CHEMBL1647881)
Ki
14±n/a nM
Citation
 Munei, YShimamoto, KHarada, MYoshida, TChuman, H Correlation analyses on binding affinity of substituted benzenesulfonamides with carbonic anhydrase using ab initio MO calculations on their complex structures (II). Bioorg Med Chem Lett 21:141-4 (2010)  
Target
Name:
Carbonic anhydrase 2
Synonyms:
CA2 Carbonic anhydrase Carbonic anhydrase II Carbonic anhydrase II (CA-II)
Type:
Enzyme Catalytic Domain
Mol. Mass.:
29115.93
Organism:
Bos taurus
Description:
Residue:
260
  
Inhibitor
Name:
BDBM81918
Synonyms:
p-Halide-sulfanilamide derivative, 2a
Type:
Small organic molecule
Emp. Form.:
C6H6BrNO2S
Mol. Mass.:
236.086
SMILES:
NS(=O)(=O)c1ccc(Br)cc1
: