Target
Carbonic anhydrase 2
Ligand
BDBM10857
Substrate
Meas. Tech.
ChEMBL_698608 (CHEMBL1647881)
Ki
851±n/a nM
Citation
 Munei, YShimamoto, KHarada, MYoshida, TChuman, H Correlation analyses on binding affinity of substituted benzenesulfonamides with carbonic anhydrase using ab initio MO calculations on their complex structures (II). Bioorg Med Chem Lett 21:141-4 (2010)  
Target
Name:
Carbonic anhydrase 2
Synonyms:
CA2 Carbonic anhydrase Carbonic anhydrase II Carbonic anhydrase II (CA-II)
Type:
Enzyme Catalytic Domain
Mol. Mass.:
29115.93
Organism:
Bos taurus
Description:
Residue:
260
  
Inhibitor
Name:
BDBM10857
Synonyms:
4-aminobenzene-1-sulfonamide Sulfanilamide aromatic/heteroaromatic sulfonamide 2 | halogenosulfanilamide deriv. 5a
Type:
Small organic molecule
Emp. Form.:
C6H8N2O2S
Mol. Mass.:
172.205
SMILES:
Nc1ccc(cc1)S(N)(=O)=O
: