Target
Muscarinic acetylcholine receptor M5
Ligand
BDBM50423968
Substrate
Meas. Tech.
ChEMBL_935571 (CHEMBL2320107)
EC50
>30000±n/a nM
Citation
 Le, UMelancon, BJBridges, TMVinson, PNUtley, TJLamsal, ARodriguez, ALVenable, DSheffler, DJJones, CKBlobaum, ALWood, MRDaniels, JSConn, PJNiswender, CMLindsley, CWHopkins, CR Discovery of a selective M4 positive allosteric modulator based on the 3-amino-thieno[2,3-b]pyridine-2-carboxamide scaffold: development of ML253, a potent and brain penetrant compound that is active in a preclinical model of schizophrenia. Bioorg Med Chem Lett 23:346-50 (2012)  
Target
Name:
Muscarinic acetylcholine receptor M5
Synonyms:
ACM5_RAT Chrm-5 Muscarinic acetylcholine receptor | Muscarinic acetylcholine receptor M5
Type:
Enzyme Catalytic Domain
Mol. Mass.:
60161.80
Organism:
RAT
Description:
Cholinergic, muscarinic M5 CHRM5 RAT::P08911
Residue:
531
  
Inhibitor
Name:
BDBM50423968
Synonyms:
CHEMBL2313377
Type:
Small organic molecule
Emp. Form.:
C13H14ClN3OS
Mol. Mass.:
295.788
SMILES:
Cc1nc2sc(C(=O)NC3CC3)c(N)c2c(C)c1Cl
: