Target
Fatty-acid amide hydrolase 1 [30-579]
Ligand
BDBM97458
Substrate
Meas. Tech.
ChEMBL_934690 (CHEMBL2318384)
IC50
9.4±n/a nM
Citation
 Wilson, AAHicks, JWSadovski, OParkes, JTong, JHoule, SFowler, CJVasdev, N Radiosynthesis and evaluation of [¹¹C-carbonyl]-labeled carbamates as fatty acid amide hydrolase radiotracers for positron emission tomography. J Med Chem 56:201-9 (2013)  
Target
Name:
Fatty-acid amide hydrolase 1 [30-579]
Synonyms:
Anandamide amidohydrolase 1 Faah Fatty Acid Amide Hydrolase Fatty-acid amide hydrolase (FAAH) Fatty-acid amide hydrolase 1 (FAAH) Oleamide hydrolase 1
Type:
Single-pass membrane protein; homodimer
Mol. Mass.:
60474.00
Organism:
Rattus norvegicus (rat)
Description:
P97612 (aa 30-579)
Residue:
550
  
Inhibitor
Name:
BDBM97458
Synonyms:
FAAH Inhibitor, 2g
Type:
Small molecule
Emp. Form.:
C19H21NO3
Mol. Mass.:
311.3749
SMILES:
Oc1ccc(OC(=O)NC2CCCCC2)cc1-c1ccccc1
: