Target
Ricin
Ligand
BDBM50424241
Substrate
Meas. Tech.
ChEMBL_934991 (CHEMBL2320360)
IC50
6000±n/a nM
Citation
 Saito, RPruet, JMManzano, LAJasheway, KMonzingo, AFWiget, PAKamat, IAnslyn, EVRobertus, JD Peptide-conjugated pterins as inhibitors of ricin toxin A. J Med Chem 56:320-9 (2013)  
Target
Name:
Ricin
Synonyms:
RICI_RICCO
Type:
PROTEIN
Mol. Mass.:
64090.82
Organism:
Ricinus communis
Description:
ChEMBL_1286970
Residue:
576
  
Inhibitor
Name:
BDBM50424241
Synonyms:
CHEMBL2314138
Type:
Small organic molecule
Emp. Form.:
C18H17N7O6
Mol. Mass.:
427.3709
SMILES:
Nc1nc2nc(cnc2c(=O)[nH]1)C(=O)NCC(=O)N[C@@H](Cc1ccc(O)cc1)C(O)=O
: