Target
Multidrug and toxin extrusion protein 1
Ligand
BDBM22890
Substrate
Meas. Tech.
ChEMBL_934320 (CHEMBL2320306)
IC50
>500000±n/a nM
Citation
 Wittwer, MBZur, AAKhuri, NKido, YKosaka, AZhang, XMorrissey, KMSali, AHuang, YGiacomini, KM Discovery of potent, selective multidrug and toxin extrusion transporter 1 (MATE1, SLC47A1) inhibitors through prescription drug profiling and computational modeling. J Med Chem 56:781-95 (2013)  
Target
Name:
Multidrug and toxin extrusion protein 1
Synonyms:
MATE-1 S47A1_HUMAN Solute carrier family 47 member 1 | hMATE-1
Type:
PROTEIN
Mol. Mass.:
61928.01
Organism:
Homo sapiens (Human)
Description:
ChEMBL_934313
Residue:
570
  
Inhibitor
Name:
BDBM22890
Synonyms:
2-(2-{4-[(4-chlorophenyl)(phenyl)methyl]piperazin-1-yl}ethoxy)acetic acid Cetirizine | Levocetirizine
Type:
Small organic molecule
Emp. Form.:
C21H25ClN2O3
Mol. Mass.:
388.888
SMILES:
OC(=O)COCCN1CCN(CC1)C(c1ccccc1)c1ccc(Cl)cc1
: