Target
Solute carrier family 22 member 1
Ligand
BDBM85330
Substrate
Meas. Tech.
ChEMBL_934316 (CHEMBL2320302)
IC50
>300000±n/a nM
Citation
 Wittwer, MBZur, AAKhuri, NKido, YKosaka, AZhang, XMorrissey, KMSali, AHuang, YGiacomini, KM Discovery of potent, selective multidrug and toxin extrusion transporter 1 (MATE1, SLC47A1) inhibitors through prescription drug profiling and computational modeling. J Med Chem 56:781-95 (2013)  
Target
Name:
Solute carrier family 22 member 1
Synonyms:
Adrenergic Alpha Organic cation transporter 1 SLC22A1 hOCT1
Type:
Enzyme Catalytic Domain
Mol. Mass.:
61154.85
Organism:
Homo sapiens (Human)
Description:
Adrenergic Alpha 0 HUMAN::O15245
Residue:
554
  
Inhibitor
Name:
BDBM85330
Synonyms:
CAS_68647 ONDANSETRON | Ondansetron hydrochloride
Type:
Small organic molecule
Emp. Form.:
C18H19N3O
Mol. Mass.:
293.363
SMILES:
Cc1nccn1CC1CCc2c(C1=O)c1ccccc1n2C
: